20th Anniversary
  회원가입   회원찾기
  ID PW
 
  설치/초보
  시스템 관리
  네트워크
  어플리케이션
  기타
  이전 솔라리스 설치 관련
  이전 어플리케이션 관련
  이전 네트웍 관련
  이전 기타
 

   제 목 : [질문]MYSQL 컴파일시 에러
   작성자 : 초보 날짜 : 2003-03-20
   분류 : 설치/초보 조회수 : 1146

아래 질문들을 다 찾아서 시키는 대로 다 했는데도
MYSQL을 컴파일 하는 과정에..에러가 납니다.

------------------------------------------------------------------
sql_lex.cc:87: `sql_functions\' undeclared (first use this function)
sql_lex.cc: In function `int find_keyword(LEX*, unsigned int, bool)\':
sql_lex.cc:171: `get_hash_symbol\' undeclared (first use this function)
gmake[4]: *** [sql_lex.o] Error 1
gmake[4]: Leaving directory `/tmp/APM/mysql-4.0.12/sql\'
gmake[3]: *** [all-recursive] Error 1
gmake[3]: Leaving directory `/tmp/APM/mysql-4.0.12/sql\'
gmake[2]: *** [all] Error 2
gmake[2]: Leaving directory `/tmp/APM/mysql-4.0.12/sql\'
gmake[1]: *** [all-recursive] Error 1
gmake[1]: Leaving directory `/tmp/APM/mysql-4.0.12\'
gmake: *** [all] Error 2
--------------------------------------------------------------------
무슨 에러인지 모르겠습니다.
get_hash_symbol이 선언되지 않았다니..이런..

[목록보기]  [출력]  
  사이트 소개  |  연락처  |  사이트 맵  |  이메일주소 무단 수집 거부 Copyright (c) 2020 Solaris School. All rights reserved.